{"text_format":"1","workbook":"xlsx","n_sheets":11,"sheets":["Guidance","Summary","Beef","Dairy","Sheep","Cropping","Drainage","General inputs and assumptions","Document control","Calcs - hide","Lookups - hide"],"not_rendered":{"charts":2,"images":3,"macros":1,"external_links":0,"defined_names":4,"comments":0,"pivot_tables":0},"unopened":[],"bounds":{"document_bytes":16777216,"sheet_cells":100000,"rows_first":2000,"rows_last":500,"rows_between":2000,"halvings":0,"cell_chars":16384,"cell_head_chars":4096},"cells_cut":0,"cells_raw":0,"read":"whole","date_system":"1900"}

{"sheet":"Guidance","index":0,"n_rows":40,"n_cols":13,"rows_kept":40,"cut":false,"hidden":false,"merged":[]}
["Guidance"]
[]
[]
[null,null,"The purpose of this tool is for individual landholders and groups of landholders to assess if  "]
[null,null,"renewing and maintaining on-farm drains is economically viable."]
[]
[null,null,"The tool is designed to be as simple as possible to provide an approximation of economic viability, "]
[null,null,"as a first step towards determining if further investigation and detail is warranted. All outputs "]
{"$rows_left_out":33}
{"sheet":"Summary","index":1,"n_rows":34,"n_cols":18,"rows_kept":34,"cut":false,"hidden":false,"merged":[[30,5,30,6],[5,4,7,4],[8,4,10,4],[11,4,13,4],[14,4,16,4],[17,4,19,4],[23,4,23,5],[24,4,24,5],[25,4,25,5],[26,4,26,5],[22,4,22,5]]}
["Summary"]
[]
[]
[null,null,"SUMMARY OF INPUTS"]
[null,null,"Button",null,"Beef","Description","Units","Property 1 ","Property 2","Property 3","Property 4","Property 5","Property 6","Property 7","Property 8","Property 9","Property 10","ALL PROPERTIES"]
[null,null,null,null,"Beef","Number of breeding livestock in a typical year with no drainage works","head",{"$f":"IF(Beef!C4=0,\"\",Beef!C4)","v":""},{"$f":"IF(Beef!D4=0,\"\",Beef!D4)","v":""},{"$f":"IF(Beef!E4=0,\"\",Beef!E4)","v":""},{"$f":"IF(Beef!F4=0,\"\",Beef!F4)","v":""},{"$f":"IF(Beef!G4=0,\"\",Beef!G4)","v":""},{"$f":"IF(Beef!H4=0,\"\",Beef!H4)","v":""},{"$f":"IF(Beef!I4=0,\"\",Beef!I4)","v":""},{"$f":"IF(Beef!J4=0,\"\",Beef!J4)","v":""},{"$f":"IF(Beef!K4=0,\"\",Beef!K4)","v":""},{"$f":"IF(Beef!L4=0,\"\",Beef!L4)","v":""},{"$f":"SUM(H6:Q6)","v":0}]
[null,null,null,null,null,"Expected number of breeding livestock in a typical year with improved drainage","head",{"$f":"IF(Beef!C5=0,\"\",Beef!C5)","v":""},{"$f":"IF(Beef!D5=0,\"\",Beef!D5)","v":""},{"$f":"IF(Beef!E5=0,\"\",Beef!E5)","v":""},{"$f":"IF(Beef!F5=0,\"\",Beef!F5)","v":""},{"$f":"IF(Beef!G5=0,\"\",Beef!G5)","v":""},{"$f":"IF(Beef!H5=0,\"\",Beef!H5)","v":""},{"$f":"IF(Beef!I5=0,\"\",Beef!I5)","v":""},{"$f":"IF(Beef!J5=0,\"\",Beef!J5)","v":""},{"$f":"IF(Beef!K5=0,\"\",Beef!K5)","v":""},{"$f":"IF(Beef!L5=0,\"\",Beef!L5)","v":""},{"$f":"SUM(H7:Q7)","v":0}]
[null,null,null,null,null,"Average gross margin per head","$ per head",{"$f":"IF(H6=\"\",\"\",'Calcs - hide'!B6)","v":""},{"$f":"IF(I6=\"\",\"\",'Calcs - hide'!C6)","v":""},{"$f":"IF(J6=\"\",\"\",'Calcs - hide'!D6)","v":""},{"$f":"IF(K6=\"\",\"\",'Calcs - hide'!E6)","v":""},{"$f":"IF(L6=\"\",\"\",'Calcs - hide'!F6)","v":""},{"$f":"IF(M6=\"\",\"\",'Calcs - hide'!G6)","v":""},{"$f":"IF(N6=\"\",\"\",'Calcs - hide'!H6)","v":""},{"$f":"IF(O6=\"\",\"\",'Calcs - hide'!I6)","v":""},{"$f":"IF(P6=\"\",\"\",'Calcs - hide'!J6)","v":""},{"$f":"IF(Q6=\"\",\"\",'Calcs - hide'!K6)","v":""},"N/A"]
{"$rows_left_out":27}
{"sheet":"Beef","index":2,"n_rows":9,"n_cols":12,"rows_kept":9,"cut":false,"hidden":false,"merged":[[5,0,6,0],[7,0,8,0],[2,0,2,1],[3,0,3,1],[4,0,4,1]]}
["Beef enterprise - user inputs"]
[]
["Input description",null,"Property 1 ","Property 2","Property 3","Property 4","Property 5","Property 6","Property 7","Property 8","Property 9","Property 10"]
["On average, how many head of breeding stock would you run on each property if drains are not maintained or improved (cows per year)?"]
["If drains were improved and maintained on an ongoing basis, how many head of breeding stock would you sensibly run on each property (cows per year)?"]
["As an approximate average across the herd on each property, what is the annual gross income \nper breeding head of stock?\n(\"Gross income\" includes the annual revenue from  all livestock sales minus the value of livestock purchases - \ndefault value will apply if user value is not provided)","Default value",{"$f":"IF(OR(C4=0,C4=\"\"),\"\",'General inputs and assumptions'!$B$11)","v":""},{"$f":"IF(OR(D4=0,D4=\"\"),\"\",'General inputs and assumptions'!$B$11)","v":""},{"$f":"IF(OR(E4=0,E4=\"\"),\"\",'General inputs and assumptions'!$B$11)","v":""},{"$f":"IF(OR(F4=0,F4=\"\"),\"\",'General inputs and assumptions'!$B$11)","v":""},{"$f":"IF(OR(G4=0,G4=\"\"),\"\",'General inputs and assumptions'!$B$11)","v":""},{"$f":"IF(OR(H4=0,H4=\"\"),\"\",'General inputs and assumptions'!$B$11)","v":""},{"$f":"IF(OR(I4=0,I4=\"\"),\"\",'General inputs and assumptions'!$B$11)","v":""},{"$f":"IF(OR(J4=0,J4=\"\"),\"\",'General inputs and assumptions'!$B$11)","v":""},{"$f":"IF(OR(K4=0,K4=\"\"),\"\",'General inputs and assumptions'!$B$11)","v":""},{"$f":"IF(OR(L4=0,L4=\"\"),\"\",'General inputs and assumptions'!$B$11)","v":""}]
[null,"User input value \n(over-rides default value)"]
["As an average across the herd, what is the annual variable cost per breeding head of stock (approximately)?\n(\"Variable costs\" include costs associated with animal health, feed, pasture management, freight and selling costs - default value will apply if user value is not provided)","Default value",{"$f":"IF(OR(C4=0,C4=\"\"),\"\",'General inputs and assumptions'!$C$11)","v":""},{"$f":"IF(OR(D4=0,D4=\"\"),\"\",'General inputs and assumptions'!$C$11)","v":""},{"$f":"IF(OR(E4=0,E4=\"\"),\"\",'General inputs and assumptions'!$C$11)","v":""},{"$f":"IF(OR(F4=0,F4=\"\"),\"\",'General inputs and assumptions'!$C$11)","v":""},{"$f":"IF(OR(G4=0,G4=\"\"),\"\",'General inputs and assumptions'!$C$11)","v":""},{"$f":"IF(OR(H4=0,H4=\"\"),\"\",'General inputs and assumptions'!$C$11)","v":""},{"$f":"IF(OR(I4=0,I4=\"\"),\"\",'General inputs and assumptions'!$C$11)","v":""},{"$f":"IF(OR(J4=0,J4=\"\"),\"\",'General inputs and assumptions'!$C$11)","v":""},{"$f":"IF(OR(K4=0,K4=\"\"),\"\",'General inputs and assumptions'!$C$11)","v":""},{"$f":"IF(OR(L4=0,L4=\"\"),\"\",'General inputs and assumptions'!$C$11)","v":""}]
{"$rows_left_out":2}
{"sheet":"Dairy","index":3,"n_rows":9,"n_cols":12,"rows_kept":9,"cut":false,"hidden":false,"merged":[[2,0,2,1],[3,0,3,1],[4,0,4,1],[5,0,6,0],[7,0,8,0]]}
["Dairy enterprise - user inputs"]
[]
["Input description",null,"Property 1 ","Property 2","Property 3","Property 4","Property 5","Property 6","Property 7","Property 8","Property 9","Property 10"]
["On average, how many head of breeding stock would you run on each property if drains are not maintained or improved (cows per year)?"]
["If drains were improved and maintained on an ongoing basis, how many head of breeding stock would you sensibly run on each property (cows per year)?"]
["As an approximate average across the herd on each property, what is the annual gross income per breeding head of stock?\n(\"Gross income\" includes the annual revenue from  all milk and livestock sales minus the value of livestock purchases - default value will apply if user value is not provided)","Default value",{"$f":"IF(OR(C4=0,C4=\"\"),\"\",'General inputs and assumptions'!$B$12)","v":""},{"$f":"IF(OR(D4=0,D4=\"\"),\"\",'General inputs and assumptions'!$B$12)","v":""},{"$f":"IF(OR(E4=0,E4=\"\"),\"\",'General inputs and assumptions'!$B$12)","v":""},{"$f":"IF(OR(F4=0,F4=\"\"),\"\",'General inputs and assumptions'!$B$12)","v":""},{"$f":"IF(OR(G4=0,G4=\"\"),\"\",'General inputs and assumptions'!$B$12)","v":""},{"$f":"IF(OR(H4=0,H4=\"\"),\"\",'General inputs and assumptions'!$B$12)","v":""},{"$f":"IF(OR(I4=0,I4=\"\"),\"\",'General inputs and assumptions'!$B$12)","v":""},{"$f":"IF(OR(J4=0,J4=\"\"),\"\",'General inputs and assumptions'!$B$12)","v":""},{"$f":"IF(OR(K4=0,K4=\"\"),\"\",'General inputs and assumptions'!$B$12)","v":""},{"$f":"IF(OR(L4=0,L4=\"\"),\"\",'General inputs and assumptions'!$B$12)","v":""}]
[null,"User input value \n(over-rides default value)"]
["As an average across the herd, what is the annual variable cost per breeding head of stock (approximately)?\n(\"Variable costs\" include costs associated with animal health, feed, pasture management, freight and selling costs - default value will apply if user value is not provided)","Default value",{"$f":"IF(OR(C4=0,C4=\"\"),\"\",'General inputs and assumptions'!$C$12)","v":""},{"$f":"IF(OR(D4=0,D4=\"\"),\"\",'General inputs and assumptions'!$C$12)","v":""},{"$f":"IF(OR(E4=0,E4=\"\"),\"\",'General inputs and assumptions'!$C$12)","v":""},{"$f":"IF(OR(F4=0,F4=\"\"),\"\",'General inputs and assumptions'!$C$12)","v":""},{"$f":"IF(OR(G4=0,G4=\"\"),\"\",'General inputs and assumptions'!$C$12)","v":""},{"$f":"IF(OR(H4=0,H4=\"\"),\"\",'General inputs and assumptions'!$C$12)","v":""},{"$f":"IF(OR(I4=0,I4=\"\"),\"\",'General inputs and assumptions'!$C$12)","v":""},{"$f":"IF(OR(J4=0,J4=\"\"),\"\",'General inputs and assumptions'!$C$12)","v":""},{"$f":"IF(OR(K4=0,K4=\"\"),\"\",'General inputs and assumptions'!$C$12)","v":""},{"$f":"IF(OR(L4=0,L4=\"\"),\"\",'General inputs and assumptions'!$C$12)","v":""}]
{"$rows_left_out":2}
{"sheet":"Sheep","index":4,"n_rows":9,"n_cols":12,"rows_kept":9,"cut":false,"hidden":false,"merged":[[2,0,2,1],[3,0,3,1],[4,0,4,1],[5,0,6,0],[7,0,8,0]]}
["Sheep enterprise - user inputs"]
[]
["Input description",null,"Property 1 ","Property 2","Property 3","Property 4","Property 5","Property 6","Property 7","Property 8","Property 9","Property 10"]
["On average, how many head of breeding stock would you run on each property if drains are not maintained or improved (sheep per year)?"]
["If drains were improved and maintained on an ongoing basis, how many head of breeding stock would you sensibly run on each property (sheep per year)?"]
["As an approximate average across the flock on each property, what is the annual gross income per breeding head of stock?\n(\"Gross income\" includes the annual revenue from  all livestock sales minus the value of livestock purchases - default value will apply if user value is not provided)","Default value",{"$f":"IF(OR(C4=0,C4=\"\"),\"\",'General inputs and assumptions'!$B$13)","v":""},{"$f":"IF(OR(D4=0,D4=\"\"),\"\",'General inputs and assumptions'!$B$13)","v":""},{"$f":"IF(OR(E4=0,E4=\"\"),\"\",'General inputs and assumptions'!$B$13)","v":""},{"$f":"IF(OR(F4=0,F4=\"\"),\"\",'General inputs and assumptions'!$B$13)","v":""},{"$f":"IF(OR(G4=0,G4=\"\"),\"\",'General inputs and assumptions'!$B$13)","v":""},{"$f":"IF(OR(H4=0,H4=\"\"),\"\",'General inputs and assumptions'!$B$13)","v":""},{"$f":"IF(OR(I4=0,I4=\"\"),\"\",'General inputs and assumptions'!$B$13)","v":""},{"$f":"IF(OR(J4=0,J4=\"\"),\"\",'General inputs and assumptions'!$B$13)","v":""},{"$f":"IF(OR(K4=0,K4=\"\"),\"\",'General inputs and assumptions'!$B$13)","v":""},{"$f":"IF(OR(L4=0,L4=\"\"),\"\",'General inputs and assumptions'!$B$13)","v":""}]
[null,"User input value \n(over-rides default value)"]
["As an average across the flock, what is the annual variable cost per breeding head of stock (approximately)?\n(\"Variable costs\" include costs associated with animal health, feed, pasture management, freight and selling costs - default value will apply if user value is not provided)","Default value",{"$f":"IF(OR(C4=0,C4=\"\"),\"\",'General inputs and assumptions'!$C$13)","v":""},{"$f":"IF(OR(D4=0,D4=\"\"),\"\",'General inputs and assumptions'!$C$13)","v":""},{"$f":"IF(OR(E4=0,E4=\"\"),\"\",'General inputs and assumptions'!$C$13)","v":""},{"$f":"IF(OR(F4=0,F4=\"\"),\"\",'General inputs and assumptions'!$C$13)","v":""},{"$f":"IF(OR(G4=0,G4=\"\"),\"\",'General inputs and assumptions'!$C$13)","v":""},{"$f":"IF(OR(H4=0,H4=\"\"),\"\",'General inputs and assumptions'!$C$13)","v":""},{"$f":"IF(OR(I4=0,I4=\"\"),\"\",'General inputs and assumptions'!$C$13)","v":""},{"$f":"IF(OR(J4=0,J4=\"\"),\"\",'General inputs and assumptions'!$C$13)","v":""},{"$f":"IF(OR(K4=0,K4=\"\"),\"\",'General inputs and assumptions'!$C$13)","v":""},{"$f":"IF(OR(L4=0,L4=\"\"),\"\",'General inputs and assumptions'!$C$13)","v":""}]
{"$rows_left_out":2}
{"sheet":"Cropping","index":5,"n_rows":11,"n_cols":12,"rows_kept":11,"cut":false,"hidden":false,"merged":[[2,0,2,1],[5,0,5,1],[6,0,6,1],[7,0,8,0],[9,0,10,0]]}
["Cropping enterprise - user inputs"]
[]
["Input description",null,"Property 1 ","Property 2","Property 3","Property 4","Property 5","Property 6","Property 7","Property 8","Property 9","Property 10"]
["On average, what area of your land would you use for cropping if drains are not maintained or improved (hectares)?"]
["On average, what is an estimate of your annual crop yield for all crops, across all areas cropped,  if drains were not maintained or improved (tonnes per hectare)?"]
["If drains were improved and maintained on an ongoing basis, what area of your land would you expect to use for cropping (hectares)?"]
["If drains were improved and maintained on an ongoing basis, what is an estimate of your annual crop yield for all crops, across all areas cropped (tonnes per hectare)?"]
["What is your expected annual gross income per tonne in an average year (approximately)?\n(\"Gross income\" includes the annual revenue from sale of all crops over the year - default value will apply if user value is not provided)","Default value",{"$f":"IF(OR(C4=0,C4=\"\"),\"\",'General inputs and assumptions'!$B$14)","v":""},{"$f":"IF(OR(D4=0,D4=\"\"),\"\",'General inputs and assumptions'!$B$14)","v":""},{"$f":"IF(OR(E4=0,E4=\"\"),\"\",'General inputs and assumptions'!$B$14)","v":""},{"$f":"IF(OR(F4=0,F4=\"\"),\"\",'General inputs and assumptions'!$B$14)","v":""},{"$f":"IF(OR(G4=0,G4=\"\"),\"\",'General inputs and assumptions'!$B$14)","v":""},{"$f":"IF(OR(H4=0,H4=\"\"),\"\",'General inputs and assumptions'!$B$14)","v":""},{"$f":"IF(OR(I4=0,I4=\"\"),\"\",'General inputs and assumptions'!$B$14)","v":""},{"$f":"IF(OR(J4=0,J4=\"\"),\"\",'General inputs and assumptions'!$B$14)","v":""},{"$f":"IF(OR(K4=0,K4=\"\"),\"\",'General inputs and assumptions'!$B$14)","v":""},{"$f":"IF(OR(L4=0,L4=\"\"),\"\",'General inputs and assumptions'!$B$14)","v":""}]
{"$rows_left_out":4}
{"sheet":"Drainage","index":6,"n_rows":13,"n_cols":12,"rows_kept":13,"cut":false,"hidden":false,"merged":[[6,0,7,0],[8,0,9,0],[2,0,2,1],[3,0,3,1],[4,0,4,1],[5,0,5,1]]}
["Drainage"]
[]
["Input description",null,"Property 1 ","Property 2","Property 3","Property 4","Property 5","Property 6","Property 7","Property 8","Property 9","Property 10"]
["What is the approximate total length of drains on your property (in metres)?"]
["What total length of drains currently require refurbishment to function properly (in metres)?"]
["What is the current condition of drains (poor = significant upfront work to function effectively, average = some upfront work to function effectively, good = little unfront work to function effectively)?"]
["What is the approximate  cost per metre to refurbish drains? \n(default value  will apply unless user input value is provided)                  ","Default value",{"$f":"IF(OR(C$5=0,C$5=\"\"),\"\",IF(C6=\"\",\"select condition\",'General inputs and assumptions'!$B$18*VLOOKUP(C6,DRAINCOND,2,FALSE)))","v":""},{"$f":"IF(OR(D$5=0,D$5=\"\"),\"\",IF(D6=\"\",\"select condition\",'General inputs and assumptions'!$B$18*VLOOKUP(D6,DRAINCOND,2,FALSE)))","v":""},{"$f":"IF(OR(E$5=0,E$5=\"\"),\"\",IF(E6=\"\",\"select condition\",'General inputs and assumptions'!$B$18*VLOOKUP(E6,DRAINCOND,2,FALSE)))","v":""},{"$f":"IF(OR(F$5=0,F$5=\"\"),\"\",IF(F6=\"\",\"select condition\",'General inputs and assumptions'!$B$18*VLOOKUP(F6,DRAINCOND,2,FALSE)))","v":""},{"$f":"IF(OR(G$5=0,G$5=\"\"),\"\",IF(G6=\"\",\"select condition\",'General inputs and assumptions'!$B$18*VLOOKUP(G6,DRAINCOND,2,FALSE)))","v":""},{"$f":"IF(OR(H$5=0,H$5=\"\"),\"\",IF(H6=\"\",\"select condition\",'General inputs and assumptions'!$B$18*VLOOKUP(H6,DRAINCOND,2,FALSE)))","v":""},{"$f":"IF(OR(I$5=0,I$5=\"\"),\"\",IF(I6=\"\",\"select condition\",'General inputs and assumptions'!$B$18*VLOOKUP(I6,DRAINCOND,2,FALSE)))","v":""},{"$f":"IF(OR(J$5=0,J$5=\"\"),\"\",IF(J6=\"\",\"select condition\",'General inputs and assumptions'!$B$18*VLOOKUP(J6,DRAINCOND,2,FALSE)))","v":""},{"$f":"IF(OR(K$5=0,K$5=\"\"),\"\",IF(K6=\"\",\"select condition\",'General inputs and assumptions'!$B$18*VLOOKUP(K6,DRAINCOND,2,FALSE)))","v":""},{"$f":"IF(OR(L$5=0,L$5=\"\"),\"\",IF(L6=\"\",\"select condition\",'General inputs and assumptions'!$B$18*VLOOKUP(L6,DRAINCOND,2,FALSE)))","v":""}]
[null,"User input value \n(over-rides default value)"]
{"$rows_left_out":6}
{"sheet":"General inputs and assumptions","index":7,"n_rows":22,"n_cols":7,"rows_kept":22,"cut":false,"hidden":false,"merged":[[16,1,16,2],[17,1,17,2],[18,1,18,2],[19,0,21,0]]}
["General inputs and assumptions"]
[]
[null,null,null,null,null,"Comment","Info sources"]
["Required rate of return on capital",0.1,"per annum",null,null,"Variable depending on operation. Should be reflective of enterprise owner's hurdle rate (not social discount rate)"]
["Evaluation period",25,"years"]
["Ramp up period to achieve full benefit of drain refurbushment",5,"years",null,null,"Reflects that herds will typically  be built up through breeding over a few years once carrying capacity has increased"]
[]
[]
{"$rows_left_out":15}
{"sheet":"Document control","index":8,"n_rows":11,"n_cols":14,"rows_kept":11,"cut":false,"hidden":false,"merged":[[10,2,10,12],[10,13,10,16],[4,2,4,12],[4,13,4,16],[8,2,8,12],[8,13,8,16],[9,2,9,12],[9,13,9,16],[5,2,5,12],[5,13,5,16],[6,2,6,12],[6,13,6,16],[7,2,7,12],[7,13,7,16]]}
["Rural Drainage AssessmentTool"]
[]
[]
["Version","Date","Description",null,null,null,null,null,null,null,null,null,null,"Changes made by"]
[1,"2017-06-16","Initial version of tool presented to DELWP for feedback.",null,null,null,null,null,null,null,null,null,null,"Lucas van Raalte (Jacobs)"]
[1.01,"2017-06-23","Definitions added. Chart added to 'Summary' sheet showing flows of costs and benefits. ",null,null,null,null,null,null,null,null,null,null,"Lucas van Raalte (Jacobs)"]
[1.02,"2017-07-04","Production values updated. Ramp up period of benefits added. Changes to 'Summary' sheet calcs.",null,null,null,null,null,null,null,null,null,null,"Lucas van Raalte (Jacobs)"]
[1.03,"2017-09-01","Extended to multiple properties and functionality for mixed farming. Drainage sheet added and condition function. Revised 'Summary' and 'Guidance'.",null,null,null,null,null,null,null,null,null,null,"Lucas van Raalte (Jacobs)"]
{"$rows_left_out":4}
{"sheet":"Calcs - hide","index":9,"n_rows":123,"n_cols":13,"rows_kept":123,"cut":false,"hidden":true,"merged":[]}
[]
["Production values:"]
[]
["Gross margins per unit:"]
[null,"Property 1","Property 2","Property 3","Property 4","Property 5","Property 6","Property 7","Property 8","Property 9","Property 10"]
["Beef (per breeding head)",{"$f":"IFERROR(IF(Beef!C$7>0,Beef!C$7,Beef!C$6)-IF(Beef!C$9>0,Beef!C$9,Beef!C$8),0)","v":0},{"$f":"IFERROR(IF(Beef!D$7>0,Beef!D$7,Beef!D$6)-IF(Beef!D$9>0,Beef!D$9,Beef!D$8),0)","v":0},{"$f":"IFERROR(IF(Beef!E$7>0,Beef!E$7,Beef!E$6)-IF(Beef!E$9>0,Beef!E$9,Beef!E$8),0)","v":0},{"$f":"IFERROR(IF(Beef!F$7>0,Beef!F$7,Beef!F$6)-IF(Beef!F$9>0,Beef!F$9,Beef!F$8),0)","v":0},{"$f":"IFERROR(IF(Beef!G$7>0,Beef!G$7,Beef!G$6)-IF(Beef!G$9>0,Beef!G$9,Beef!G$8),0)","v":0},{"$f":"IFERROR(IF(Beef!H$7>0,Beef!H$7,Beef!H$6)-IF(Beef!H$9>0,Beef!H$9,Beef!H$8),0)","v":0},{"$f":"IFERROR(IF(Beef!I$7>0,Beef!I$7,Beef!I$6)-IF(Beef!I$9>0,Beef!I$9,Beef!I$8),0)","v":0},{"$f":"IFERROR(IF(Beef!J$7>0,Beef!J$7,Beef!J$6)-IF(Beef!J$9>0,Beef!J$9,Beef!J$8),0)","v":0},{"$f":"IFERROR(IF(Beef!K$7>0,Beef!K$7,Beef!K$6)-IF(Beef!K$9>0,Beef!K$9,Beef!K$8),0)","v":0},{"$f":"IFERROR(IF(Beef!L$7>0,Beef!L$7,Beef!L$6)-IF(Beef!L$9>0,Beef!L$9,Beef!L$8),0)","v":0}]
["Dairy (per breeding head)",{"$f":"IFERROR(IF(Dairy!C$7>0,Dairy!C$7,Dairy!C$6)-IF(Dairy!C$9>0,Dairy!C$9,Dairy!C$8),0)","v":0},{"$f":"IFERROR(IF(Dairy!D$7>0,Dairy!D$7,Dairy!D$6)-IF(Dairy!D$9>0,Dairy!D$9,Dairy!D$8),0)","v":0},{"$f":"IFERROR(IF(Dairy!E$7>0,Dairy!E$7,Dairy!E$6)-IF(Dairy!E$9>0,Dairy!E$9,Dairy!E$8),0)","v":0},{"$f":"IFERROR(IF(Dairy!F$7>0,Dairy!F$7,Dairy!F$6)-IF(Dairy!F$9>0,Dairy!F$9,Dairy!F$8),0)","v":0},{"$f":"IFERROR(IF(Dairy!G$7>0,Dairy!G$7,Dairy!G$6)-IF(Dairy!G$9>0,Dairy!G$9,Dairy!G$8),0)","v":0},{"$f":"IFERROR(IF(Dairy!H$7>0,Dairy!H$7,Dairy!H$6)-IF(Dairy!H$9>0,Dairy!H$9,Dairy!H$8),0)","v":0},{"$f":"IFERROR(IF(Dairy!I$7>0,Dairy!I$7,Dairy!I$6)-IF(Dairy!I$9>0,Dairy!I$9,Dairy!I$8),0)","v":0},{"$f":"IFERROR(IF(Dairy!J$7>0,Dairy!J$7,Dairy!J$6)-IF(Dairy!J$9>0,Dairy!J$9,Dairy!J$8),0)","v":0},{"$f":"IFERROR(IF(Dairy!K$7>0,Dairy!K$7,Dairy!K$6)-IF(Dairy!K$9>0,Dairy!K$9,Dairy!K$8),0)","v":0},{"$f":"IFERROR(IF(Dairy!L$7>0,Dairy!L$7,Dairy!L$6)-IF(Dairy!L$9>0,Dairy!L$9,Dairy!L$8),0)","v":0}]
["Sheep  (per breeding head)",{"$f":"IFERROR(IF(Sheep!C$7>0,Sheep!C$7,Sheep!C$6)-IF(Sheep!C$9>0,Sheep!C$9,Sheep!C$8),0)","v":0},{"$f":"IFERROR(IF(Sheep!D$7>0,Sheep!D$7,Sheep!D$6)-IF(Sheep!D$9>0,Sheep!D$9,Sheep!D$8),0)","v":0},{"$f":"IFERROR(IF(Sheep!E$7>0,Sheep!E$7,Sheep!E$6)-IF(Sheep!E$9>0,Sheep!E$9,Sheep!E$8),0)","v":0},{"$f":"IFERROR(IF(Sheep!F$7>0,Sheep!F$7,Sheep!F$6)-IF(Sheep!F$9>0,Sheep!F$9,Sheep!F$8),0)","v":0},{"$f":"IFERROR(IF(Sheep!G$7>0,Sheep!G$7,Sheep!G$6)-IF(Sheep!G$9>0,Sheep!G$9,Sheep!G$8),0)","v":0},{"$f":"IFERROR(IF(Sheep!H$7>0,Sheep!H$7,Sheep!H$6)-IF(Sheep!H$9>0,Sheep!H$9,Sheep!H$8),0)","v":0},{"$f":"IFERROR(IF(Sheep!I$7>0,Sheep!I$7,Sheep!I$6)-IF(Sheep!I$9>0,Sheep!I$9,Sheep!I$8),0)","v":0},{"$f":"IFERROR(IF(Sheep!J$7>0,Sheep!J$7,Sheep!J$6)-IF(Sheep!J$9>0,Sheep!J$9,Sheep!J$8),0)","v":0},{"$f":"IFERROR(IF(Sheep!K$7>0,Sheep!K$7,Sheep!K$6)-IF(Sheep!K$9>0,Sheep!K$9,Sheep!K$8),0)","v":0},{"$f":"IFERROR(IF(Sheep!L$7>0,Sheep!L$7,Sheep!L$6)-IF(Sheep!L$9>0,Sheep!L$9,Sheep!L$8),0)","v":0}]
{"$rows_left_out":116}
{"sheet":"Lookups - hide","index":10,"n_rows":15,"n_cols":3,"rows_kept":15,"cut":false,"hidden":true,"merged":[]}
[]
[]
["Production types:",null,"Beef"]
[null,null,"Dairy"]
[null,null,"Sheep"]
[null,null,"Cropping"]
[]
["Cropping types:",null,"Canola "]
{"$rows_left_out":7}